Target
Serine/threonine-protein kinase pim-1
Ligand
BDBM50391939
Substrate
Meas. Tech.
ChEMBL_849985 (CHEMBL2149642)
IC50
17±n/a nM
Citation
 Nakano, HSaito, NParker, LTada, YAbe, MTsuganezawa, KYokoyama, STanaka, AKojima, HOkabe, TNagano, T Rational evolution of a novel type of potent and selective proviral integration site in Moloney murine leukemia virus kinase 1 (PIM1) inhibitor from a screening-hit compound. J Med Chem 55:5151-64 (2012)  
Target
Name:
Serine/threonine-protein kinase pim-1
Synonyms:
PIM-1 Kinase PIM1_HUMAN Serine/threonine-protein kinase (PIM1) Serine/threonine-protein kinase PIM1 | Serine/threonine-protein kinase pim-1 (PIM1)
Type:
Protein
Mol. Mass.:
35681.82
Organism:
Homo sapiens (Human)
Description:
P11309
Residue:
313
  
Inhibitor
Name:
BDBM50391939
Synonyms:
CHEMBL2147760
Type:
Small organic molecule
Emp. Form.:
C22H21N3O3
Mol. Mass.:
375.4204
SMILES:
Oc1ccc2C(=O)\C(Oc2c1CN1CCNCC1)=C\c1c[nH]c2ccccc12
: