Target
Tyrosine-protein kinase JAK1
Ligand
BDBM50391996
Substrate
Meas. Tech.
ChEMBL_851246 (CHEMBL2155758)
Ki
0.4±n/a nM
Citation
 Kulagowski, JJBlair, WBull, RJChang, CDeshmukh, GDyke, HJEigenbrot, CGhilardi, NGibbons, PHarrison, TKHewitt, PRLiimatta, MHurley, CAJohnson, AJohnson, TKenny, JRBir Kohli, PMaxey, RJMendonca, RMortara, KMurray, JNarukulla, RShia, SSteffek, MUbhayakar, SUltsch, Mvan Abbema, AWard, SIWaszkowycz, BZak, M Identification of imidazo-pyrrolopyridines as novel and potent JAK1 inhibitors. J Med Chem 55:5901-21 (2012)  
Target
Name:
Tyrosine-protein kinase JAK1
Synonyms:
JAK-1 JAK1A JAK1_HUMAN Janus kinase 1 (JAK1) | Janus kinase 1 JAK1
Type:
Protein
Mol. Mass.:
133293.73
Organism:
Homo sapiens (Human)
Description:
P23458
Residue:
1154
  
Inhibitor
Name:
BDBM50391996
Synonyms:
CHEMBL2152300
Type:
Small organic molecule
Emp. Form.:
C16H16N6O
Mol. Mass.:
308.3378
SMILES:
O=C(CC#N)N1CCC[C@H](C1)n1cnc2cnc3[nH]ccc3c12
: