Target
D(3) dopamine receptor
Ligand
BDBM50392131
Substrate
Meas. Tech.
ChEMBL_851591 (CHEMBL2157076)
EC50
0.87±n/a nM
Citation
 Johnson, MAntonio, TReith, MEDutta, AK Structure-activity relationship study of N6-(2-(4-(1H-Indol-5-yl)piperazin-1-yl)ethyl)-N6-propyl-4,5,6,7-tetrahydrobenzo[d]thiazole-2,6-diamine analogues: development of highly selective D3 dopamine receptor agonists along with a highly potent D2/D3 agonist and their pharmacological characterizatio J Med Chem 55:5826-40 (2012)  
Target
Name:
D(3) dopamine receptor
Synonyms:
DOPAMINE D3 DRD3_HUMAN Dopamine D3 receptor (D3) Dopamine receptor Dopamine receptor D3
Type:
Mol. Mass.:
44243.43
Organism:
Homo sapiens (Human)
Description:
Residue:
400
  
Inhibitor
Name:
BDBM50392131
Synonyms:
CHEMBL2152752
Type:
Small organic molecule
Emp. Form.:
C25H34N6OS
Mol. Mass.:
466.642
SMILES:
CCCN(CCN1CCN(CC1)C(=O)c1c[nH]c2ccccc12)[C@H]1CCc2nc(N)sc2C1
: