Target
Mitogen-activated protein kinase 14
Ligand
BDBM50392196
Substrate
Meas. Tech.
ChEMBL_852265 (CHEMBL2155531)
IC50
20±n/a nM
Citation
 Koeberle, SCFischer, SSchollmeyer, DSchattel, VGrütter, CRauh, DLaufer, SA Design, synthesis, and biological evaluation of novel disubstituted dibenzosuberones as highly potent and selective inhibitors of p38 mitogen activated protein kinase. J Med Chem 55:5868-77 (2012)  
Target
Name:
Mitogen-activated protein kinase 14
Synonyms:
CSAID-binding protein CSBP1 CSPB1 MAP kinase 14 MAP kinase p38 alpha MAPK14 MK14_HUMAN Mitogen-activated protein kinase p38 alpha Stress-activated protein kinase 2a | p38 MAP kinase alpha/beta
Type:
Serine/threonine-protein kinase
Mol. Mass.:
41286.76
Organism:
Homo sapiens (Human)
Description:
Q16539
Residue:
360
  
Inhibitor
Name:
BDBM50392196
Synonyms:
CHEMBL2152966
Type:
Small organic molecule
Emp. Form.:
C21H15F2NO2
Mol. Mass.:
351.3461
SMILES:
Oc1cccc2c1CCc1cc(Nc3ccc(F)cc3F)ccc1C2=O
: