Target
11-beta-hydroxysteroid dehydrogenase type 2
Ligand
BDBM50392216
Substrate
Meas. Tech.
ChEMBL_852703 (CHEMBL2156825)
IC50
>30000±n/a nM
Citation
 Scott, JSBowker, SSDeschoolmeester, JGerhardt, SHargreaves, DKilgour, ELloyd, AMayers, RMMcCoull, WNewcombe, NJOgg, DPacker, MJRees, ARevill, JSchofield, PSelmi, NSwales, JGWhittamore, PR Discovery of a potent, selective, and orally bioavailable acidic 11ß-hydroxysteroid dehydrogenase type 1 (11ß-HSD1) inhibitor: discovery of 2-[(3S)-1-[5-(cyclohexylcarbamoyl)-6-propylsulfanylpyridin-2-yl]-3-piperidyl]acetic acid (AZD4017). J Med Chem 55:5951-64 (2012)  
Target
Name:
11-beta-hydroxysteroid dehydrogenase type 2
Synonyms:
11-DH2 11-beta-Hydroxysteroid Dehydrogenase 2 (11-beta-HSD2) 11-beta-hydroxysteroid dehydrogenase 2 11-beta-hydroxysteroid dehydrogenase type 2 (11-beta-HSD2) DHI2_HUMAN HSD11K SDR9C3
Type:
Enzyme
Mol. Mass.:
44141.72
Organism:
Homo sapiens (Human)
Description:
Purified recombinant human 11beta-HSD2.
Residue:
405
  
Inhibitor
Name:
BDBM50392216
Synonyms:
CHEMBL2153191 | US8673938, 7
Type:
Small organic molecule
Emp. Form.:
C22H33N3O3S
Mol. Mass.:
419.581
SMILES:
CCCSc1nc(ccc1C(=O)NC1CCCCC1)N1CCC[C@@H](CC(O)=O)C1
: