Target
Asparagine synthetase [glutamine-hydrolyzing]
Ligand
BDBM50378579
Substrate
Meas. Tech.
ChEMBL_851318 (CHEMBL2156025)
Ki
280±n/a nM
Citation
 Ikeuchi, HAhn, YMOtokawa, TWatanabe, BHegazy, LHiratake, JRichards, NG A sulfoximine-based inhibitor of human asparagine synthetase kills L-asparaginase-resistant leukemia cells. Bioorg Med Chem 20:5915-27 (2012)  
Target
Name:
Asparagine synthetase [glutamine-hydrolyzing]
Synonyms:
ASNS Asparagine synthetase | TS11
Type:
PROTEIN
Mol. Mass.:
64373.20
Organism:
Homo sapiens (Human)
Description:
ChEMBL_851327
Residue:
561
  
Inhibitor
Name:
BDBM50378579
Synonyms:
CHEMBL1627258
Type:
Small organic molecule
Emp. Form.:
C14H22N7O9PS
Mol. Mass.:
495.405
SMILES:
CS(=O)(CC(=N)C(O)=O)NP(O)(=O)OC[C@H]1O[C@H]([C@H](O)[C@@H]1O)n1cnc2c(N)ncnc12
: