Target
Phosphatidylinositol 4,5-bisphosphate 3-kinase catalytic subunit alpha isoform
Ligand
BDBM50392453
Substrate
Meas. Tech.
ChEMBL_851911 (CHEMBL2156788)
IC50
1905±n/a nM
Citation
 Certal, VHalley, FVirone-Oddos, AThompson, FFiloche-Rommé, BEl-Ahmad, YCarry, JCDelorme, CKarlsson, AAbecassis, PYVincent, LBonnevaux, HNicolas, JPMorales, RMichot, NVade, ILouboutin, APerron, SDoerflinger, GTric, BMonget, SLengauer, CSchio, L Preparation and optimization of new 4-(morpholin-4-yl)-(6-oxo-1,6-dihydropyrimidin-2-yl)amide derivatives as PI3Kß inhibitors. Bioorg Med Chem Lett 22:6381-4 (2012)  
Target
Name:
Phosphatidylinositol 4,5-bisphosphate 3-kinase catalytic subunit alpha isoform
Synonyms:
P42336 PI3-kinase subunit p110-alpha PIK3CA Phosphatidylinositol 3-kinase alpha (PI3Kalpha) Phosphatidylinositol 4,5-bisphosphate 3-kinase (PI3K) Phosphatidylinositol 4,5-bisphosphate 3-kinase catalytic subunit alpha (PI3Kalpha) Phosphatidylinositol 4,5-bisphosphate 3-kinase catalytic subunit alpha isoform (PI3-Ka) Phosphatidylinositol 4,5-bisphosphate 3-kinase catalytic subunit alpha isoform (PI3K p110alpha) Phosphatidylinositol 4,5-bisphosphate 3-kinase catalytic subunit alpha isoform (PI3K-alpha) Phosphatidylinositol 4,5-bisphosphate 3-kinase catalytic subunit alpha isoform (PI3Kalpha p110alpha) Phosphatidylinositol 4,5-bisphosphate 3-kinase catalytic subunit alpha isoform (PIK3CA) Phosphatidylinositol-4,5-bisphosphate 3-kinase catalytic subunit alpha isoform Phosphoinositide 3-Kinase (PI3K), alpha Chain A Phosphoinositide 3-kinases (PI3K) PtdIns-3-kinase p110 | p110 alpha
Type:
Enzyme Subunit
Mol. Mass.:
124294.87
Organism:
Homo sapiens (Human)
Description:
P42336
Residue:
1068
  
Inhibitor
Name:
BDBM50392453
Synonyms:
CHEMBL2151923
Type:
Small organic molecule
Emp. Form.:
C16H17BrN4O3
Mol. Mass.:
393.235
SMILES:
Brc1cccc(NC(=O)Cc2nc(cc(=O)[nH]2)N2CCOCC2)c1
: