Target
Cytochrome P450 3A4
Ligand
BDBM50392466
Substrate
Meas. Tech.
ChEMBL_851921 (CHEMBL2156798)
IC50
40000±n/a nM
Citation
 Certal, VHalley, FVirone-Oddos, AThompson, FFiloche-Rommé, BEl-Ahmad, YCarry, JCDelorme, CKarlsson, AAbecassis, PYVincent, LBonnevaux, HNicolas, JPMorales, RMichot, NVade, ILouboutin, APerron, SDoerflinger, GTric, BMonget, SLengauer, CSchio, L Preparation and optimization of new 4-(morpholin-4-yl)-(6-oxo-1,6-dihydropyrimidin-2-yl)amide derivatives as PI3Kß inhibitors. Bioorg Med Chem Lett 22:6381-4 (2012)  
Target
Name:
Cytochrome P450 3A4
Synonyms:
Albendazole monooxygenase CP3A4_HUMAN CYP3A4 CYPIIIA4 Cytochrome P450 3A4 (CYP3A4) Nifedipine oxidase Taurochenodeoxycholate 6-alpha-hydroxylase
Type:
Enzyme
Mol. Mass.:
57349.57
Organism:
Homo sapiens (Human)
Description:
Residue:
503
  
Inhibitor
Name:
BDBM50392466
Synonyms:
CHEMBL2151935
Type:
Small organic molecule
Emp. Form.:
C17H18ClFN4O3
Mol. Mass.:
380.801
SMILES:
Cn1c(CC(=O)Nc2ccc(F)c(Cl)c2)nc(cc1=O)N1CCOCC1
: