Target
Neutral ceramidase
Ligand
BDBM50392471
Substrate
Meas. Tech.
ChEMBL_852173 (CHEMBL2157594)
IC50
54000±n/a nM
Citation
 Bhabak, KPArenz, C Novel amide- and sulfonamide-based aromatic ethanolamines: effects of various substituents on the inhibition of acid and neutral ceramidases. Bioorg Med Chem 20:6162-70 (2012)  
Target
Name:
Neutral ceramidase
Synonyms:
ASAH2 Acylsphingosine deacylase 2 HNAC1 N-CDase NCDase Non-lysosomal ceramidase | hCD
Type:
PROTEIN
Mol. Mass.:
85523.37
Organism:
Homo sapiens (Human)
Description:
ChEMBL_947546
Residue:
780
  
Inhibitor
Name:
BDBM50392471
Synonyms:
CHEMBL2152040
Type:
Small organic molecule
Emp. Form.:
C21H36N2O6S
Mol. Mass.:
444.585
SMILES:
CCCCCCCCCCCCS(=O)(=O)N[C@H](CO)[C@H](O)c1ccc(cc1)[N+]([O-])=O
: