Target
Cholesteryl ester transfer protein
Ligand
BDBM50392509
Substrate
Meas. Tech.
ChEMBL_852277 (CHEMBL2155543)
IC50
13070±n/a nM
Citation
 Miller, MMLiu, YJiang, JJohnson, JAKamau, MNirschl, DSWang, YHarikrishnan, LTaylor, DSChen, AYYin, XSeethala, RPeterson, TLZvyaga, TZhang, JHuang, CSWexler, RRPoss, MALawrence, RMAdam, LPSalvati, ME Identification of a potent and metabolically stable series of fluorinated diphenylpyridylethanamine-based cholesteryl ester transfer protein inhibitors. Bioorg Med Chem Lett 22:6503-8 (2012)  
Target
Name:
Cholesteryl ester transfer protein
Synonyms:
CETP Cholesteryl ester transfer protein (CETP) | Lipid transfer protein I
Type:
Enzyme
Mol. Mass.:
54751.53
Organism:
Homo sapiens (Human)
Description:
P11597
Residue:
493
  
Inhibitor
Name:
BDBM50392509
Synonyms:
CHEMBL2152164
Type:
Small organic molecule
Emp. Form.:
C27H24ClF6N3O
Mol. Mass.:
555.942
SMILES:
Fc1cc(cc(c1)[C@](Cc1ccccc1)(NC(=O)NC1CCC(F)(F)CC1)c1ccc(Cl)cn1)C(F)(F)F
: