Target
Cholesteryl ester transfer protein
Ligand
BDBM50392525
Substrate
Meas. Tech.
ChEMBL_852277 (CHEMBL2155543)
IC50
4630±n/a nM
Citation
 Miller, MMLiu, YJiang, JJohnson, JAKamau, MNirschl, DSWang, YHarikrishnan, LTaylor, DSChen, AYYin, XSeethala, RPeterson, TLZvyaga, TZhang, JHuang, CSWexler, RRPoss, MALawrence, RMAdam, LPSalvati, ME Identification of a potent and metabolically stable series of fluorinated diphenylpyridylethanamine-based cholesteryl ester transfer protein inhibitors. Bioorg Med Chem Lett 22:6503-8 (2012)  
Target
Name:
Cholesteryl ester transfer protein
Synonyms:
CETP Cholesteryl ester transfer protein (CETP) | Lipid transfer protein I
Type:
Enzyme
Mol. Mass.:
54751.53
Organism:
Homo sapiens (Human)
Description:
P11597
Residue:
493
  
Inhibitor
Name:
BDBM50392525
Synonyms:
CHEMBL2152178
Type:
Small organic molecule
Emp. Form.:
C27H22ClF8N3O2
Mol. Mass.:
607.923
SMILES:
FC(F)C(F)(F)Oc1cc(F)cc(c1)[C@](Cc1ccccc1)(NC(=O)N1CCC[C@@H]1C(F)(F)F)c1ccc(Cl)cn1
: