Target
Nitric oxide synthase, endothelial
Ligand
BDBM50392587
Substrate
Meas. Tech.
ChEMBL_854482 (CHEMBL2155041)
IC50
200±n/a nM
Citation
 Stefani, HAGueogjan, KManarin, FFarsky, SHZukerman-Schpector, JCaracelli, IPizano Rodrigues, SRMuscará, MNTeixeira, SASantin, JRMachado, IDBolonheis, SMCuri, RVinolo, MA Synthesis, biological evaluation and molecular docking studies of 3-(triazolyl)-coumarin derivatives: effect on inducible nitric oxide synthase. Eur J Med Chem 58:117-27 (2012)  
Target
Name:
Nitric oxide synthase, endothelial
Synonyms:
Constitutive NOS Endothelial NOS NOS type III NOS3_HUMAN Nitric oxide synthase (inducible and endothelial) Nitric-oxide synthase (endothelial and brain) eNOS
Type:
Enzyme Catalytic Domain
Mol. Mass.:
133297.84
Organism:
Homo sapiens (Human)
Description:
P29474
Residue:
1203
  
Inhibitor
Name:
BDBM50392587
Synonyms:
CHEMBL1230023
Type:
Small organic molecule
Emp. Form.:
C10H14N2OS
Mol. Mass.:
210.296
SMILES:
CCC[C@H]1COc2ccsc2C(N)=N1
: