Target
Alpha-1D adrenergic receptor
Ligand
BDBM50392641
Substrate
Meas. Tech.
ChEMBL_854049 (CHEMBL2155390)
Kd
11.75±n/a nM
Citation
 Fumagalli, LPallavicini, MBudriesi, RGobbi, MStraniero, VZagami, MChiodini, GBolchi, CChiarini, AMicucci, MValoti, E Affinity and activity profiling of unichiral 8-substituted 1,4-benzodioxane analogues of WB4101 reveals a potent and selectivea1B-adrenoceptor antagonist. Eur J Med Chem 58:184-91 (2012)  
Target
Name:
Alpha-1D adrenergic receptor
Synonyms:
ADA1D_RAT Adra1d Alpha-1D adrenergic receptor | Serotonin 1a (5-HT1a) receptor/Adrenergic receptor alpha-1
Type:
Protein
Mol. Mass.:
59375.97
Organism:
Rattus norvegicus (Rat)
Description:
P23944
Residue:
561
  
Inhibitor
Name:
BDBM50392641
Synonyms:
CHEMBL2153553
Type:
Small organic molecule
Emp. Form.:
C20H25NO6
Mol. Mass.:
375.4156
SMILES:
COc1cccc(OC)c1OCCNC[C@H]1COc2cccc(OC)c2O1
: