Target
Dihydrofolate reductase
Ligand
BDBM50392654
Substrate
Meas. Tech.
ChEMBL_854112 (CHEMBL2153943)
IC50
33±n/a nM
Citation
 Zhang, ZTian, CZhou, SWang, WGuo, YXia, JLiu, ZWang, BWang, XGolding, BTGriff, RJDu, YLiu, J Mechanism-based design, synthesis and biological studies of N5-substituted tetrahydrofolate analogs as inhibitors of cobalamin-dependent methionine synthase and potential anticancer agents. Eur J Med Chem 58:228-36 (2012)  
Target
Name:
Dihydrofolate reductase
Synonyms:
DHFR Dihydrofolate reductase (DHFR) | Tetrahydrofolate dehydrogenase
Type:
Enzyme
Mol. Mass.:
21453.99
Organism:
Homo sapiens (Human)
Description:
Recombinant human DHFR.
Residue:
187
  
Inhibitor
Name:
BDBM50392654
Synonyms:
CHEMBL2153709
Type:
Small organic molecule
Emp. Form.:
C21H27N7O5
Mol. Mass.:
457.483
SMILES:
CN(CC1CCc2nc(N)nc(N)c2N1)c1ccc(cc1)C(=O)N[C@@H](CCC(O)=O)C(O)=O
: