Target
Mitogen-activated protein kinase kinase kinase 19
Ligand
BDBM50393109
Substrate
Meas. Tech.
ChEMBL_853872 (CHEMBL2154992)
Kd
220±n/a nM
Citation
 Shengule, SRLoa-Kum-Cheung, WLParish, CRBlairvacq, MMeijer, LNakao, YKaruso, P A one-pot synthesis and biological activity of ageladine A and analogues. J Med Chem 54:2492-503 (2011)  
Target
Name:
Mitogen-activated protein kinase kinase kinase 19
Synonyms:
M3K19_HUMAN RCK YSK4
Type:
PROTEIN
Mol. Mass.:
150549.39
Organism:
Homo sapiens (Human)
Description:
ChEMBL_774616
Residue:
1328
  
Inhibitor
Name:
BDBM50393109
Synonyms:
CHEMBL2153264
Type:
Small organic molecule
Emp. Form.:
C11H9N5
Mol. Mass.:
211.2227
SMILES:
Nc1nc2c(nccc2[nH]1)-c1ccccn1
: