Target
Succinate receptor 1
Ligand
BDBM50393157
Substrate
Meas. Tech.
ChEMBL_852820 (CHEMBL2156127)
IC50
180±n/a nM
Citation
 Bhuniya, DUmrani, DDave, BSalunke, DKukreja, GGundu, JNaykodi, MShaikh, NSShitole, PKurhade, SDe, SMajumdar, SReddy, SBTambe, SShejul, YChugh, APalle, VPMookhtiar, KACully, DVacca, JChakravarty, PKNargund, RPWright, SDGraziano, MPSingh, SBRoy, SCai, TQ Discovery of a potent and selective small molecule hGPR91 antagonist. Bioorg Med Chem Lett 21:3596-602 (2011)  
Target
Name:
Succinate receptor 1
Synonyms:
G-protein coupled receptor 91 P2Y purinoceptor 1-like SUCR1_HUMAN
Type:
PROTEIN
Mol. Mass.:
38709.48
Organism:
Homo sapiens (Human)
Description:
ChEMBL_852820
Residue:
334
  
Inhibitor
Name:
BDBM50393157
Synonyms:
CHEMBL2153595
Type:
Small organic molecule
Emp. Form.:
C21H16ClF3N4O2
Mol. Mass.:
448.826
SMILES:
FC(F)(F)Oc1ccc(cc1Cl)-c1nnc(CCCCc2ccc3cccnc3n2)o1
: