Target
Succinate receptor 1
Ligand
BDBM50393148
Substrate
Meas. Tech.
ChEMBL_852824 (CHEMBL2155423)
IC50
67±n/a nM
Citation
 Bhuniya, DUmrani, DDave, BSalunke, DKukreja, GGundu, JNaykodi, MShaikh, NSShitole, PKurhade, SDe, SMajumdar, SReddy, SBTambe, SShejul, YChugh, APalle, VPMookhtiar, KACully, DVacca, JChakravarty, PKNargund, RPWright, SDGraziano, MPSingh, SBRoy, SCai, TQ Discovery of a potent and selective small molecule hGPR91 antagonist. Bioorg Med Chem Lett 21:3596-602 (2011)  
Target
Name:
Succinate receptor 1
Synonyms:
G-protein coupled receptor 91 SUCR1_RAT | Sucnr1
Type:
PROTEIN
Mol. Mass.:
36694.40
Organism:
Rattus norvegicus
Description:
ChEMBL_852824
Residue:
317
  
Inhibitor
Name:
BDBM50393148
Synonyms:
CHEMBL2153586
Type:
Small organic molecule
Emp. Form.:
C25H19ClN4O
Mol. Mass.:
426.898
SMILES:
Clc1cccc(c1)-c1ccc(cc1)-c1nnc(CCCc2ccc3cccnc3n2)o1
: