Target
Solute carrier family 22 member 2
Ligand
BDBM8961
Substrate
Meas. Tech.
ChEMBL_852936 (CHEMBL2154120)
IC50
680±n/a nM
Citation
 Kido, YMatsson, PGiacomini, KM Profiling of a prescription drug library for potential renal drug-drug interactions mediated by the organic cation transporter 2. J Med Chem 54:4548-58 (2011)  
Target
Name:
Solute carrier family 22 member 2
Synonyms:
OCT2 S22A2_HUMAN hOCT2
Type:
PROTEIN
Mol. Mass.:
62591.01
Organism:
Homo sapiens (Human)
Description:
ChEMBL_1484077
Residue:
555
  
Inhibitor
Name:
BDBM8961
Synonyms:
1,2,3,4-tetrahydro-9-acridinamine 9-THA CHEMBL1337960 Cognex Tracine cid_1935 | tacrine.HCl
Type:
Small organic molecule
Emp. Form.:
C13H14N2
Mol. Mass.:
198.2637
SMILES:
Nc1c2CCCCc2nc2ccccc12
: