Target
Multidrug and toxin extrusion protein 2
Ligand
BDBM23620
Substrate
Meas. Tech.
ChEMBL_852940 (CHEMBL2154124)
IC50
74000±n/a nM
Citation
 Kido, YMatsson, PGiacomini, KM Profiling of a prescription drug library for potential renal drug-drug interactions mediated by the organic cation transporter 2. J Med Chem 54:4548-58 (2011)  
Target
Name:
Multidrug and toxin extrusion protein 2
Synonyms:
Kidney-specific H(+)/organic cation antiporter MATE2 SLC47A2 hMATE-2
Type:
PROTEIN
Mol. Mass.:
65098.38
Organism:
Homo sapiens (Human)
Description:
ChEMBL_934314
Residue:
602
  
Inhibitor
Name:
BDBM23620
Synonyms:
2-({6-[bis(2-hydroxyethyl)amino]-4,8-bis(piperidin-1-yl)pyrimido[5,4-d][1,3]diazin-2-yl}(2-hydroxyethyl)amino)ethan-1-ol Dipyridamine Dipyudamine Persantine cid_3108
Type:
Small organic molecule
Emp. Form.:
C24H40N8O4
Mol. Mass.:
504.6256
SMILES:
OCCN(CCO)c1nc(N2CCCCC2)c2nc(nc(N3CCCCC3)c2n1)N(CCO)CCO
: