Target
Acyl-CoA 6-desaturase
Ligand
BDBM50362592
Substrate
Meas. Tech.
ChEMBL_852951 (CHEMBL2154135)
IC50
>100000000±n/a nM
Citation
 Oballa, RMBelair, LBlack, WCBleasby, KChan, CCDesroches, CDu, XGordon, RGuay, JGuiral, SHafey, MJHamelin, EHuang, ZKennedy, BLachance, NLandry, FLi, CSMancini, JNormandin, DPocai, APowell, DARamtohul, YKSkorey, KSørensen, DSturkenboom, WStyhler, AWaddleton, DMWang, HWong, SXu, LZhang, L Development of a liver-targeted stearoyl-CoA desaturase (SCD) inhibitor (MK-8245) to establish a therapeutic window for the treatment of diabetes and dyslipidemia. J Med Chem 54:5082-96 (2011)  
Target
Name:
Acyl-CoA 6-desaturase
Synonyms:
FADS2 Fatty acid desaturase 2
Type:
PROTEIN
Mol. Mass.:
52278.85
Organism:
Homo sapiens (Human)
Description:
ChEMBL_852951
Residue:
444
  
Inhibitor
Name:
BDBM50362592
Synonyms:
CHEMBL1938870
Type:
Small organic molecule
Emp. Form.:
C17H16BrFN6O4
Mol. Mass.:
467.249
SMILES:
OC(=O)Cn1nnc(n1)-c1cc(no1)N1CCC(CC1)Oc1cc(F)ccc1Br
: