Target
T-cell surface antigen CD2
Ligand
BDBM50393200
Substrate
Meas. Tech.
ChEMBL_850654 (CHEMBL2155744)
IC50
9.4±n/a nM
Citation
 Gokhale, AWeldeghiorghis, TKTaneja, VSatyanarayanajois, SD Conformationally constrained peptides from CD2 to modulate protein-protein interactions between CD2 and CD58. J Med Chem 54:5307-19 (2011)  
Target
Name:
T-cell surface antigen CD2
Synonyms:
CD2 CD_antigen=CD2 LFA-2 Rosette receptor T-cell surface antigen T11/Leu-5
Type:
PROTEIN
Mol. Mass.:
39473.97
Organism:
Homo sapiens (Human)
Description:
ChEMBL_850654
Residue:
351
  
Inhibitor
Name:
BDBM50393200
Synonyms:
CHEMBL2153727
Type:
Small organic molecule
Emp. Form.:
C52H77N11O18
Mol. Mass.:
1144.2307
SMILES:
CC[C@H](C)[C@@H]1NC(=O)[C@H](CC(O)=O)NC(=O)[C@H](CC(O)=O)NC(=O)[C@@H]2CCCN2C(=O)[C@H]2CCCN2C(=O)[C@H](CC(O)=O)NC(=O)[C@H](Cc2ccc(O)cc2)NC(=O)[C@@H](NC(=O)[C@H](CO)NC(=O)[C@H](CCCCN)NC1=O)[C@@H](C)CC
: