Target
Protein kinase C eta type
Ligand
BDBM50393222
Substrate
Meas. Tech.
ChEMBL_850746 (CHEMBL2156015)
IC50
9.1±n/a nM
Citation
 Wagner, Jvon Matt, PFaller, BCooke, NGAlbert, RSedrani, RWiegand, HJean, CBeerli, CWeckbecker, GEvenou, JPZenke, GCottens, S Structure-activity relationship and pharmacokinetic studies of sotrastaurin (AEB071), a promising novel medicine for prevention of graft rejection and treatment of psoriasis. J Med Chem 54:6028-39 (2011)  
Target
Name:
Protein kinase C eta type
Synonyms:
KPCL_HUMAN PKCL PRKCL Protein kinase C, PKC; classical/novel | nPKC-eta
Type:
Enzyme
Mol. Mass.:
77844.26
Organism:
Homo sapiens (Human)
Description:
The recombinant human PKC enzymes were produced using a baculovirus expression system in SF9 cells
Residue:
683
  
Inhibitor
Name:
BDBM50393222
Synonyms:
CHEMBL2151408
Type:
Small organic molecule
Emp. Form.:
C25H21ClN6O2
Mol. Mass.:
472.926
SMILES:
CN1CCN(CC1)c1nc(C2=C(C(=O)NC2=O)c2c[nH]c3ccc(Cl)cc23)c2ccccc2n1
: