Target
Protein kinase C theta type
Ligand
BDBM50393224
Substrate
Meas. Tech.
ChEMBL_850747 (CHEMBL2156016)
IC50
7±n/a nM
Citation
 Wagner, Jvon Matt, PFaller, BCooke, NGAlbert, RSedrani, RWiegand, HJean, CBeerli, CWeckbecker, GEvenou, JPZenke, GCottens, S Structure-activity relationship and pharmacokinetic studies of sotrastaurin (AEB071), a promising novel medicine for prevention of graft rejection and treatment of psoriasis. J Med Chem 54:6028-39 (2011)  
Target
Name:
Protein kinase C theta type
Synonyms:
KPCT_HUMAN PRKCT Protein kinase C theta type (PRKCQ) nPKC-theta
Type:
Serine/threonine-protein kinase
Mol. Mass.:
81878.04
Organism:
Homo sapiens (Human)
Description:
Full-length human PKC theta (Panvera Catalog No. P2996).
Residue:
706
  
Inhibitor
Name:
BDBM50393224
Synonyms:
CHEMBL2151410
Type:
Small organic molecule
Emp. Form.:
C25H21ClN6O2
Mol. Mass.:
472.926
SMILES:
CN1CCN(CC1)c1nc(C2=C(C(=O)NC2=O)c2c[nH]c3c(Cl)cccc23)c2ccccc2n1
: