Target
Protein kinase C beta type
Ligand
BDBM50393226
Substrate
Meas. Tech.
ChEMBL_850743 (CHEMBL2156012)
IC50
2±n/a nM
Citation
 Wagner, Jvon Matt, PFaller, BCooke, NGAlbert, RSedrani, RWiegand, HJean, CBeerli, CWeckbecker, GEvenou, JPZenke, GCottens, S Structure-activity relationship and pharmacokinetic studies of sotrastaurin (AEB071), a promising novel medicine for prevention of graft rejection and treatment of psoriasis. J Med Chem 54:6028-39 (2011)  
Target
Name:
Protein kinase C beta type
Synonyms:
KPCB_HUMAN PKC beta PKCB PRKCB1 Protein kinase C beta type | Protein kinase C beta type II (PRKCB2)
Type:
Enzyme
Mol. Mass.:
76873.67
Organism:
Homo sapiens (Human)
Description:
The recombinant human PKC enzymes were produced using a baculovirus expression system in SF9 cells
Residue:
671
  
Inhibitor
Name:
BDBM50393226
Synonyms:
CHEMBL2153748
Type:
Small organic molecule
Emp. Form.:
C26H23N5O2
Mol. Mass.:
437.4931
SMILES:
CN1CCN(CC1)c1cc2ccccc2c(n1)C1=C(C(=O)NC1=O)c1c[nH]c2ccccc12
: