Target
Protein kinase C epsilon type
Ligand
BDBM50393227
Substrate
Meas. Tech.
ChEMBL_850745 (CHEMBL2156014)
IC50
6.2±n/a nM
Citation
 Wagner, Jvon Matt, PFaller, BCooke, NGAlbert, RSedrani, RWiegand, HJean, CBeerli, CWeckbecker, GEvenou, JPZenke, GCottens, S Structure-activity relationship and pharmacokinetic studies of sotrastaurin (AEB071), a promising novel medicine for prevention of graft rejection and treatment of psoriasis. J Med Chem 54:6028-39 (2011)  
Target
Name:
Protein kinase C epsilon type
Synonyms:
KPCE_HUMAN PKCE Protein kinase C epsilon Protein kinase C, PKC; classical/novel nPKC-epsilon
Type:
Enzyme
Mol. Mass.:
83680.45
Organism:
Homo sapiens (Human)
Description:
The recombinant human PKC enzymes were produced using a baculovirus expression system in SF9 cells
Residue:
737
  
Inhibitor
Name:
BDBM50393227
Synonyms:
CHEMBL2153749
Type:
Small organic molecule
Emp. Form.:
C26H24N6O2
Mol. Mass.:
452.5078
SMILES:
CN1CCN(CC1)c1nc(C2=C(C(=O)NC2=O)c2c[nH]c3ccccc23)c2c(C)cccc2n1
: