Target
Neuronal acetylcholine receptor subunit alpha-7
Ligand
BDBM50060417
Substrate
Meas. Tech.
ChEMBL_851194 (CHEMBL2155622)
EC50
1500±n/a nM
Citation
 Mazurov, AASpeake, JDYohannes, D Discovery and development ofa7 nicotinic acetylcholine receptor modulators. J Med Chem 54:7943-61 (2011)  
Target
Name:
Neuronal acetylcholine receptor subunit alpha-7
Synonyms:
ACHA7_HUMAN Cholinergic, Nicotinic Alpha7 Neuronal acetylcholine receptor protein alpha-7 subunit Nicotinic acetylcholine receptor alpha-7 (alpha7 nAChR)
Type:
Mol. Mass.:
56448.33
Organism:
Homo sapiens (Human)
Description:
CHRNA7 (NACHRA7)
Residue:
502
  
Inhibitor
Name:
BDBM50060417
Synonyms:
5-Methyl-3,5-dihydro-2H-pyrrolo[2,3-f]indole-1-carboxylic acid pyridin-3-ylamide SB 206553 | SB-206553
Type:
Small organic molecule
Emp. Form.:
C17H16N4O
Mol. Mass.:
292.3351
SMILES:
Cn1ccc2cc3N(CCc3cc12)C(=O)Nc1cccnc1
: