Target
Hypoxia-inducible factor 1-alpha
Ligand
BDBM50393288
Substrate
Meas. Tech.
ChEMBL_851754 (CHEMBL2156222)
EC50
1850±n/a nM
Citation
 Theriault, JRFelts, ASBates, BSPerez, JRPalmer, MGilbert, SRDawson, ESEngers, JLLindsley, CWEmmitte, KA Discovery of a new molecular probe ML228: an activator of the hypoxia inducible factor (HIF) pathway. Bioorg Med Chem Lett 22:76-81 (2011)  
Target
Name:
Hypoxia-inducible factor 1-alpha
Synonyms:
BHLHE78 HIF-1-alpha, HIF-2-alpha HIF1A_HUMAN Hypoxia-inducible factor 1 alpha MOP1 von Hippel-Lindau disease tumor suppressor/Elongin-C/Elongin-B/HIF1A
Type:
Protein
Mol. Mass.:
92647.24
Organism:
Homo sapiens (Human)
Description:
Q16665
Residue:
826
  
Inhibitor
Name:
BDBM50393288
Synonyms:
CHEMBL2142554
Type:
Small organic molecule
Emp. Form.:
C23H21N5
Mol. Mass.:
367.4463
SMILES:
Cc1ccc(CNc2nc(nnc2-c2ccccc2)-c2ccccn2)cc1C
: