Target
Presenilin-1
Ligand
BDBM50393452
Substrate
Meas. Tech.
ChEMBL_855747 (CHEMBL2160915)
IC50
1.3±n/a nM
Citation
 Wu, WLDomalski, MBurnett, DAJosien, HBara, TRajagopalan, MXu, RClader, JGreenlee, WJBrunskill, AHyde, LADel Vecchio, RACohen-Williams, MESong, LLee, JTerracina, GZhang, QNomeir, AParker, EMZhang, L Discovery of SCH 900229, a Potent Presenilin 1 Selective ¿-Secretase Inhibitor for the Treatment of Alzheimer's Disease. ACS Med Chem Lett 3:892-896 (2012)  
Target
Name:
Presenilin-1
Synonyms:
3.4.23.- Gamma-Secretase Subunit Presenilin-1 PS1 PSEN1 PSNL1 Presenilin-1 CTF12 Protein S182
Type:
Mol. Mass.:
52657.13
Organism:
Homo sapiens (Human)
Description:
P49768
Residue:
467
  
Inhibitor
Name:
BDBM50393452
Synonyms:
CHEMBL2159511
Type:
Small organic molecule
Emp. Form.:
C21H21ClF2O6S2
Mol. Mass.:
506.968
SMILES:
CS(=O)(=O)CC[C@@H]1OCC[C@@]2([C@H]1COc1c(F)ccc(F)c21)S(=O)(=O)c1ccc(Cl)cc1
: