Target
Tyrosine-protein phosphatase non-receptor type 22
Ligand
BDBM50393464
Substrate
Meas. Tech.
ChEMBL_855963 (CHEMBL2161837)
IC50
13030±n/a nM
Citation
 Stanford, SMKrishnamurthy, DFalk, MDMessina, RDebnath, BLi, SLiu, TKazemi, RDahl, RHe, YYu, XChan, ACZhang, ZYBarrios, AMWoods, VLNeamati, NBottini, N Discovery of a novel series of inhibitors of lymphoid tyrosine phosphatase with activity in human T cells. J Med Chem 54:1640-54 (2011)  
Target
Name:
Tyrosine-protein phosphatase non-receptor type 22
Synonyms:
3.1.3.48 LyP Lymphoid phosphatase (Lyp) PEST-domain phosphatase PTPN22 Tyrosine-protein phosphatase non-receptor type 22 (LYP) | tyrosine-protein phosphatase non-receptor type 22 isoform 1
Type:
Mol. Mass.:
91712.31
Organism:
Homo sapiens (Human)
Description:
Q9Y2R2
Residue:
807
  
Inhibitor
Name:
BDBM50393464
Synonyms:
CHEMBL2159941
Type:
Small organic molecule
Emp. Form.:
C32H34N6O2
Mol. Mass.:
534.6514
SMILES:
COc1ccc(CN(Cc2ccccc2)C(c2nnnn2C2CCCC2)c2cc3cc(C)ccc3[nH]c2=O)cc1
: