Target
Tyrosine-protein phosphatase non-receptor type 22
Ligand
BDBM50393466
Substrate
Meas. Tech.
ChEMBL_855963 (CHEMBL2161837)
IC50
17120±n/a nM
Citation
 Stanford, SMKrishnamurthy, DFalk, MDMessina, RDebnath, BLi, SLiu, TKazemi, RDahl, RHe, YYu, XChan, ACZhang, ZYBarrios, AMWoods, VLNeamati, NBottini, N Discovery of a novel series of inhibitors of lymphoid tyrosine phosphatase with activity in human T cells. J Med Chem 54:1640-54 (2011)  
Target
Name:
Tyrosine-protein phosphatase non-receptor type 22
Synonyms:
3.1.3.48 LyP Lymphoid phosphatase (Lyp) PEST-domain phosphatase PTPN22 Tyrosine-protein phosphatase non-receptor type 22 (LYP) | tyrosine-protein phosphatase non-receptor type 22 isoform 1
Type:
Mol. Mass.:
91712.31
Organism:
Homo sapiens (Human)
Description:
Q9Y2R2
Residue:
807
  
Inhibitor
Name:
BDBM50393466
Synonyms:
CHEMBL2159943
Type:
Small organic molecule
Emp. Form.:
C23H30N6O
Mol. Mass.:
406.5239
SMILES:
CC1CCCN(C1)C(c1nnnn1C1CCCC1)c1cc2cc(C)ccc2[nH]c1=O
: