Target
Tyrosine-protein phosphatase non-receptor type 22
Ligand
BDBM50393463
Substrate
Meas. Tech.
ChEMBL_855966 (CHEMBL2161840)
Ki
23890±n/a nM
Citation
 Stanford, SMKrishnamurthy, DFalk, MDMessina, RDebnath, BLi, SLiu, TKazemi, RDahl, RHe, YYu, XChan, ACZhang, ZYBarrios, AMWoods, VLNeamati, NBottini, N Discovery of a novel series of inhibitors of lymphoid tyrosine phosphatase with activity in human T cells. J Med Chem 54:1640-54 (2011)  
Target
Name:
Tyrosine-protein phosphatase non-receptor type 22
Synonyms:
3.1.3.48 LyP Lymphoid phosphatase (Lyp) PEST-domain phosphatase PTPN22 Tyrosine-protein phosphatase non-receptor type 22 (LYP) | tyrosine-protein phosphatase non-receptor type 22 isoform 1
Type:
Mol. Mass.:
91712.31
Organism:
Homo sapiens (Human)
Description:
Q9Y2R2
Residue:
807
  
Inhibitor
Name:
BDBM50393463
Synonyms:
CHEMBL2159940
Type:
Small organic molecule
Emp. Form.:
C31H31ClN6O
Mol. Mass.:
539.07
SMILES:
Cc1ccc2[nH]c(=O)c(cc2c1)C(N(Cc1ccccc1)Cc1ccc(Cl)cc1)c1nnnn1C1CCCC1
: