Target
Baculoviral IAP repeat-containing protein 2
Ligand
BDBM50393505
Substrate
Meas. Tech.
ChEMBL_856200 (CHEMBL2162884)
Ki
1.9±n/a nM
Citation
 Cai, QSun, HPeng, YLu, JNikolovska-Coleska, ZMcEachern, DLiu, LQiu, SYang, CYMiller, RYi, HZhang, TSun, DKang, SGuo, MLeopold, LYang, DWang, S A potent and orally active antagonist (SM-406/AT-406) of multiple inhibitor of apoptosis proteins (IAPs) in clinical development for cancer treatment. J Med Chem 54:2714-26 (2011)  
Target
Name:
Baculoviral IAP repeat-containing protein 2
Synonyms:
API1 BIRC2_HUMAN Cellular inhibitor of apoptosis 1 MIHB | RNF48
Type:
Protein
Mol. Mass.:
69900.47
Organism:
Homo sapiens (Human)
Description:
Q13490
Residue:
618
  
Inhibitor
Name:
BDBM50393505
Synonyms:
CHEMBL2158051
Type:
Small organic molecule
Emp. Form.:
C32H43N5O4
Mol. Mass.:
561.7149
SMILES:
CN[C@@H](C)C(=O)N[C@H]1CN(CC[C@H]2CC[C@H](N2C1=O)C(=O)NC(c1ccccc1)c1ccccc1)C(=O)CC(C)C
: