Target
E3 ubiquitin-protein ligase XIAP
Ligand
BDBM50393507
Substrate
Meas. Tech.
ChEMBL_856199 (CHEMBL2162883)
Ki
26±n/a nM
Citation
 Cai, QSun, HPeng, YLu, JNikolovska-Coleska, ZMcEachern, DLiu, LQiu, SYang, CYMiller, RYi, HZhang, TSun, DKang, SGuo, MLeopold, LYang, DWang, S A potent and orally active antagonist (SM-406/AT-406) of multiple inhibitor of apoptosis proteins (IAPs) in clinical development for cancer treatment. J Med Chem 54:2714-26 (2011)  
Target
Name:
E3 ubiquitin-protein ligase XIAP
Synonyms:
API3 E3 ubiquitin-protein ligase XIAP Inhibitor of apoptosis protein 3 X-linked inhibitor of apoptosis XIAP | XIAP_HUMAN
Type:
Protein
Mol. Mass.:
56685.27
Organism:
Homo sapiens (Human)
Description:
P98170
Residue:
497
  
Inhibitor
Name:
BDBM50393507
Synonyms:
CHEMBL2158053
Type:
Small organic molecule
Emp. Form.:
C54H86N12O7S
Mol. Mass.:
1047.402
SMILES:
CN[C@@H](C)C(=O)N[C@H]1CN(CC[C@H]2CC[C@H](N2C1=O)C(=O)N[C@H](c1cn(CCCCCCCCCCNC(=O)CCCCCNC(=O)CCCC[C@@H]2SC[C@@H]3NC(=O)N[C@H]23)nn1)c1ccccc1)C(=O)CC(C)C
: