Target
cAMP-specific 3',5'-cyclic phosphodiesterase 4A
Ligand
BDBM50393512
Substrate
Meas. Tech.
ChEMBL_856427 (CHEMBL2161159)
EC50
270±n/a nM
Citation
 Day, JPLindsay, BRiddell, TJiang, ZAllcock, RWAbraham, ASookup, SChristian, FBogum, JMartin, EKRae, RLAnthony, DRosair, GMHouslay, DMHuston, EBaillie, GSKlussmann, EHouslay, MDAdams, DR Elucidation of a structural basis for the inhibitor-driven, p62 (SQSTM1)-dependent intracellular redistribution of cAMP phosphodiesterase-4A4 (PDE4A4). J Med Chem 54:3331-47 (2011)  
Target
Name:
cAMP-specific 3',5'-cyclic phosphodiesterase 4A
Synonyms:
3',5'-cyclic phosphodiesterase PDE46 PDE4A_HUMAN Phosphodiesterase 4A | Phosphodiesterase 4A (PDE4)
Type:
Enzyme
Mol. Mass.:
98113.27
Organism:
Homo sapiens (Human)
Description:
P27815
Residue:
886
  
Inhibitor
Name:
BDBM50393512
Synonyms:
CHEMBL2158057
Type:
Small organic molecule
Emp. Form.:
C17H14ClN3O
Mol. Mass.:
311.766
SMILES:
Clc1cccc(c1)-c1nn(CC2CC2)c(=O)c2cccnc12
: