Target
cAMP-specific 3',5'-cyclic phosphodiesterase 4A
Ligand
BDBM50040348
Substrate
Meas. Tech.
ChEMBL_856427 (CHEMBL2161159)
EC50
910±n/a nM
Citation
 Day, JPLindsay, BRiddell, TJiang, ZAllcock, RWAbraham, ASookup, SChristian, FBogum, JMartin, EKRae, RLAnthony, DRosair, GMHouslay, DMHuston, EBaillie, GSKlussmann, EHouslay, MDAdams, DR Elucidation of a structural basis for the inhibitor-driven, p62 (SQSTM1)-dependent intracellular redistribution of cAMP phosphodiesterase-4A4 (PDE4A4). J Med Chem 54:3331-47 (2011)  
Target
Name:
cAMP-specific 3',5'-cyclic phosphodiesterase 4A
Synonyms:
3',5'-cyclic phosphodiesterase PDE46 PDE4A_HUMAN Phosphodiesterase 4A | Phosphodiesterase 4A (PDE4)
Type:
Enzyme
Mol. Mass.:
98113.27
Organism:
Homo sapiens (Human)
Description:
P27815
Residue:
886
  
Inhibitor
Name:
BDBM50040348
Synonyms:
8-Amino-1,3-bis-cyclopropylmethyl-3,7-dihydro-purine-2,6-dione CHEMBL356323
Type:
Small organic molecule
Emp. Form.:
C13H17N5O2
Mol. Mass.:
275.3064
SMILES:
Nc1nc2n(CC3CC3)c(=O)n(CC3CC3)c(=O)c2[nH]1
: