Target
Low molecular weight phosphotyrosine protein phosphatase
Ligand
BDBM50393532
Substrate
Meas. Tech.
ChEMBL_857174 (CHEMBL2163148)
IC50
2210000±n/a nM
Citation
 Maccari, ROttanà, R Low molecular weight phosphotyrosine protein phosphatases as emerging targets for the design of novel therapeutic agents. J Med Chem 55:2-22 (2012)  
Target
Name:
Low molecular weight phosphotyrosine protein phosphatase
Synonyms:
3.1.3.2 ACP1 LMW-PTP LMWPTP PPAC_HUMAN low molecular weight phosphotyrosine protein phosphatase isoform c
Type:
Mol. Mass.:
18042.81
Organism:
Homo sapiens (Human)
Description:
P24666
Residue:
158
  
Inhibitor
Name:
BDBM50393532
Synonyms:
CHEMBL2158219
Type:
Small organic molecule
Emp. Form.:
C7H11N2O3P
Mol. Mass.:
202.1476
SMILES:
Nc1ccncc1CCP(O)(O)=O
: