Target
ALK tyrosine kinase receptor/Nucleophosmin
Ligand
BDBM50393609
Substrate
Meas. Tech.
ChEMBL_855440 (CHEMBL2162287)
IC50
100±n/a nM
Citation
 Mesaros, EFThieu, TVWells, GJZificsak, CAWagner, JCBreslin, HJTripathy, RDiebold, JLMcHugh, RJWohler, ATQuail, MRWan, WLu, LHuang, ZAlbom, MSAngeles, TSWells-Knecht, KJAimone, LDCheng, MAtor, MAOtt, GRDorsey, BD Strategies to mitigate the bioactivation of 2-anilino-7-aryl-pyrrolo[2,1-f][1,2,4]triazines: identification of orally bioavailable, efficacious ALK inhibitors. J Med Chem 55:115-25 (2012)  
Target
Name:
ALK tyrosine kinase receptor/Nucleophosmin
Synonyms:
NPM/ALK (Nucleophosmin/ALK tyrosine kinase receptor)
Type:
Mol. Mass.:
Description:
ASSAY_ID of EBI is 331455
Components:
This complex has 2 components.
Component 1
Name:
ALK tyrosine kinase receptor
Synonyms:
ALK ALK_HUMAN CD_antigen: CD246
Type:
Protein
Mol. Mass.:
176453.10
Organism:
Homo sapiens (Human)
Description:
Q9UM73
Residue:
1620
  
Component 2
Name:
Nucleophosmin
Synonyms:
NPM NPM1 | NPM_HUMAN
Type:
PROTEIN
Mol. Mass.:
32552.99
Organism:
Homo sapiens (Human)
Description:
ChEMBL_1502715
Residue:
294
  
Component 3
Name:
ALK tyrosine kinase receptor
Synonyms:
ALK ALK_HUMAN CD_antigen: CD246
Type:
Protein
Mol. Mass.:
176453.10
Organism:
Homo sapiens (Human)
Description:
Q9UM73
Residue:
1620
  
Inhibitor
Name:
BDBM50393609
Synonyms:
CHEMBL2158511
Type:
Small organic molecule
Emp. Form.:
C28H32N6O3
Mol. Mass.:
500.5921
SMILES:
CNC(=O)CN1CCC(CC1)c1ccc(Nc2ncc3ccc(-c4ccccc4OC)n3n2)c(OC)c1
: