Target
Baculoviral IAP repeat-containing protein 2
Ligand
BDBM50393635
Substrate
Meas. Tech.
ChEMBL_855617 (CHEMBL2160288)
Ki
1.9±n/a nM
Citation
 Peng, YSun, HLu, JLiu, LCai, QShen, RYang, CYYi, HWang, S Bivalent Smac mimetics with a diazabicyclic core as highly potent antagonists of XIAP and cIAP1/2 and novel anticancer agents. J Med Chem 55:106-14 (2012)  
Target
Name:
Baculoviral IAP repeat-containing protein 2
Synonyms:
API1 BIRC2_HUMAN Cellular inhibitor of apoptosis 1 MIHB | RNF48
Type:
Protein
Mol. Mass.:
69900.47
Organism:
Homo sapiens (Human)
Description:
Q13490
Residue:
618
  
Inhibitor
Name:
BDBM50393635
Synonyms:
CHEMBL2158604
Type:
Small organic molecule
Emp. Form.:
C66H88N10O8
Mol. Mass.:
1149.4671
SMILES:
CN[C@@H](C)C(=O)N[C@H]1CN(CC[C@H]2CC[C@H](N2C1=O)C(=O)NC(c1ccccc1)c1ccccc1)C(=O)CCCCCCCCCCC(=O)N1CC[C@H]2CC[C@H](N2C(=O)[C@H](C1)NC(=O)[C@H](C)NC)C(=O)NC(c1ccccc1)c1ccccc1
: