Target
Baculoviral IAP repeat-containing protein 3
Ligand
BDBM26218
Substrate
Meas. Tech.
ChEMBL_855618 (CHEMBL2160289)
Ki
18.3±n/a nM
Citation
 Peng, YSun, HLu, JLiu, LCai, QShen, RYang, CYYi, HWang, S Bivalent Smac mimetics with a diazabicyclic core as highly potent antagonists of XIAP and cIAP1/2 and novel anticancer agents. J Med Chem 55:106-14 (2012)  
Target
Name:
Baculoviral IAP repeat-containing protein 3
Synonyms:
API2 BIRC3_HUMAN Baculoviral IAP repeat-containing protein 3 (IAP1 BIR3) MIHC XIAP-BIR3 | cIAP1/cIAP2
Type:
Protein
Mol. Mass.:
68365.75
Organism:
Homo sapiens (Human)
Description:
Q13489
Residue:
604
  
Inhibitor
Name:
BDBM26218
Synonyms:
(3S,6S,10aS)-N-(diphenylmethyl)-6-[(2S)-2-(methylamino)propanamido]-5-oxo-decahydropyrrolo[1,2-a]azocine-3-carboxamide bicyclic Smac peptide mimetic, 20
Type:
Small organic molecule
Emp. Form.:
C28H36N4O3
Mol. Mass.:
476.6104
SMILES:
CN[C@@H](C)C(=O)N[C@H]1CCCC[C@H]2CC[C@H](N2C1=O)C(=O)NC(c1ccccc1)c1ccccc1
: