Target
Delta-type opioid receptor
Ligand
BDBM50393720
Substrate
Meas. Tech.
ChEMBL_856841 (CHEMBL2163106)
IC50
>20000±n/a nM
Citation
 Breslin, HJDiamond, CJKavash, RWCai, CDyatkin, ABMiskowski, TAZhang, SPWade, PRHornby, PJHe, W Identification of a duald OR antagonist/µ OR agonist as a potential therapeutic for diarrhea-predominant Irritable Bowel Syndrome (IBS-d). Bioorg Med Chem Lett 22:4869-72 (2012)  
Target
Name:
Delta-type opioid receptor
Synonyms:
Cytochrome P450 3A4 Delta opioid receptor Delta-type opioid receptor (DOR) OPRD_RAT Opioid receptor Opioid receptors; mu & delta Ror-a | Voltage-gated potassium channel
Type:
G Protein-Coupled Receptor (GPCR)
Mol. Mass.:
40465.04
Organism:
Rattus norvegicus (rat)
Description:
Competition binding assays were using CHO-K1 cell membranes expressing the opioid receptor.
Residue:
372
  
Inhibitor
Name:
BDBM50393720
Synonyms:
CHEMBL2159122 | CHEMBL3216329
Type:
Small organic molecule
Emp. Form.:
C32H37Cl2N5O5
Mol. Mass.:
642.573
SMILES:
Cl.Cl.COc1ccc(CN(C(C)c2nc(c[nH]2)-c2ccccc2)C(=O)C(N)Cc2c(C)cc(cc2C)C(N)=O)cc1C(O)=O
: