Target
Bcl-2-like protein 1
Ligand
BDBM50393837
Substrate
Meas. Tech.
ChEMBL_854896 (CHEMBL2162633)
IC50
6±n/a nM
Citation
 Zhou, HAguilar, AChen, JBai, LLiu, LMeagher, JLYang, CYMcEachern, DCong, XStuckey, JAWang, S Structure-based design of potent Bcl-2/Bcl-xL inhibitors with strong in vivo antitumor activity. J Med Chem 55:6149-61 (2012)  
Target
Name:
Bcl-2-like protein 1
Synonyms:
Anti-apoptotic Bcl-2 protein Apoptosis regulator Bcl-X BCL2-like 1 isoform 1 BCL2L1 Bcl-2-like protein 1 (Bcl-XL) Bcl-xL/Bcl-2-binding component 3 Bcl2-antagonist of cell death (BAD)
Type:
Mitochondrion membrane; Single-pass membrane protein
Mol. Mass.:
26039.60
Organism:
Homo sapiens (Human)
Description:
Residue:
233
  
Inhibitor
Name:
BDBM50393837
Synonyms:
CHEMBL2159736
Type:
Small organic molecule
Emp. Form.:
C48H53ClN8O5S2
Mol. Mass.:
921.568
SMILES:
CNC(=O)c1c(C)n(C)c(c1-c1cccc(c1)N1CCN(CC1)c1ccc(NS(=O)(=O)c2ccc(N[C@H](CCN(C)C)CSc3ccccc3)c(c2)[N+]([O-])=O)cc1)-c1ccc(Cl)cc1
: