Target
Sonic hedgehog protein
Ligand
BDBM50393848
Substrate
Meas. Tech.
ChEMBL_855507 (CHEMBL2162663)
EC50
53.8±n/a nM
Citation
 Seifert, KBüttner, ARigol, SEilert, NWandel, EGiannis, A Potent small molecule Hedgehog agonists induce VEGF expression in vitro. Bioorg Med Chem 20:6465-81 (2012)  
Target
Name:
Sonic hedgehog protein
Synonyms:
Hhg1 Shh
Type:
Protein
Mol. Mass.:
47784.50
Organism:
Mus musculus (Mouse)
Description:
Q62226
Residue:
437
  
Inhibitor
Name:
BDBM50393848
Synonyms:
CHEMBL2160032
Type:
Small organic molecule
Emp. Form.:
C30H31N3O2
Mol. Mass.:
465.586
SMILES:
CN[C@H]1CC[C@@H](CC1)N(Cc1cccc(c1)-c1ccncc1)C(=O)c1ccc(o1)-c1ccccc1
: