Target
Transmembrane protease serine 6
Ligand
BDBM50394257
Substrate
Meas. Tech.
ChEMBL_856936 (CHEMBL2160579)
Ki
11800±n/a nM
Citation
 Dosa, SStirnberg, MLülsdorff, VHäußler, DMaurer, EGütschow, M Active site mapping of trypsin, thrombin and matriptase-2 by sulfamoyl benzamidines. Bioorg Med Chem 20:6489-505 (2012)  
Target
Name:
Transmembrane protease serine 6
Synonyms:
Matriptase-2 TMPS6_HUMAN
Type:
PROTEIN
Mol. Mass.:
90001.12
Organism:
Homo sapiens (Human)
Description:
ChEMBL_1442547
Residue:
811
  
Inhibitor
Name:
BDBM50394257
Synonyms:
CHEMBL2159273
Type:
Small organic molecule
Emp. Form.:
C24H28N6O3S
Mol. Mass.:
480.581
SMILES:
NC(=[NH2+])c1ccc(CNC(=O)[C@H](Cc2ccccc2)NS(=O)(=O)c2ccc(cc2)C(N)=[NH2+])cc1
: