Target
Acetylcholinesterase
Ligand
BDBM50394330
Substrate
Meas. Tech.
ChEMBL_856948 (CHEMBL2160739)
IC50
2560±n/a nM
Citation
 Roy, KKTota, STripathi, TChander, SNath, CSaxena, AK Lead optimization studies towards the discovery of novel carbamates as potent AChE inhibitors for the potential treatment of Alzheimer's disease. Bioorg Med Chem 20:6313-20 (2012)  
Target
Name:
Acetylcholinesterase
Synonyms:
ACES_MOUSE Acetylcholinesterase (mouse AChE) Ache
Type:
Enzyme
Mol. Mass.:
68165.65
Organism:
Mus musculus (mouse)
Description:
Residue:
614
  
Inhibitor
Name:
BDBM50394330
Synonyms:
CHEMBL2159421
Type:
Small organic molecule
Emp. Form.:
C23H19Cl2FN2O2
Mol. Mass.:
445.314
SMILES:
Fc1ccccc1NC(=O)Oc1ccc2N(Cc3ccc(Cl)cc3Cl)CCCc2c1
: