Target
Acetylcholinesterase
Ligand
BDBM50394337
Substrate
Meas. Tech.
ChEMBL_856948 (CHEMBL2160739)
IC50
700±n/a nM
Citation
 Roy, KKTota, STripathi, TChander, SNath, CSaxena, AK Lead optimization studies towards the discovery of novel carbamates as potent AChE inhibitors for the potential treatment of Alzheimer's disease. Bioorg Med Chem 20:6313-20 (2012)  
Target
Name:
Acetylcholinesterase
Synonyms:
ACES_MOUSE Acetylcholinesterase (mouse AChE) Ache
Type:
Enzyme
Mol. Mass.:
68165.65
Organism:
Mus musculus (mouse)
Description:
Residue:
614
  
Inhibitor
Name:
BDBM50394337
Synonyms:
CHEMBL2159426
Type:
Small organic molecule
Emp. Form.:
C24H22Cl2N2O2
Mol. Mass.:
441.35
SMILES:
Cc1cccc(NC(=O)Oc2ccc3N(Cc4ccc(Cl)cc4Cl)CCCc3c2)c1
: