Target
Monoglyceride lipase
Ligand
BDBM50394371
Substrate
Meas. Tech.
ChEMBL_854555 (CHEMBL2161050)
IC50
9±n/a nM
Citation
 Morera, LLabar, GOrtar, GLambert, DM Development and characterization of endocannabinoid hydrolases FAAH and MAGL inhibitors bearing a benzotriazol-1-yl carboxamide scaffold. Bioorg Med Chem 20:6260-75 (2012)  
Target
Name:
Monoglyceride lipase
Synonyms:
HU-K5 Lysophospholipase-like MGL MGLL_HUMAN
Type:
Hydrolase
Mol. Mass.:
33264.56
Organism:
Homo sapiens (Human)
Description:
Human recombinant MGL (Cayman Chemical, cat# 10008354).
Residue:
303
  
Inhibitor
Name:
BDBM50394371
Synonyms:
CHEMBL2159779
Type:
Small organic molecule
Emp. Form.:
C22H21N5O
Mol. Mass.:
371.435
SMILES:
O=C(N1CCN(Cc2ccc3ccccc3c2)CC1)n1nnc2ccccc12
: