Target
Purine nucleoside phosphorylase
Ligand
BDBM50108005
Substrate
Meas. Tech.
ChEMBL_854809 (CHEMBL2162054)
Kd
170±n/a nM
Citation
 Wielgus-Kutrowska, BBreer, KHashimoto, MHikishima, SYokomatsu, TNarczyk, MDyzma, AGirstun, AStaron, KBzowska, A Trimeric purine nucleoside phosphorylase: exploring postulated one-third-of-the-sites binding in the transition state. Bioorg Med Chem 20:6758-69 (2012)  
Target
Name:
Purine nucleoside phosphorylase
Synonyms:
Inosine phosphorylase PNP Purine Nucleoside Phosphorylase (PNP) | Purine nucleoside phosphorylase
Type:
Enzyme
Mol. Mass.:
32035.18
Organism:
Bos taurus (bovine)
Description:
Residue:
289
  
Inhibitor
Name:
BDBM50108005
Synonyms:
2-Amino-3,5-dihydro-pyrrolo[3,2-d]pyrimidin-4-one CHEMBL367746
Type:
Small organic molecule
Emp. Form.:
C6H6N4O
Mol. Mass.:
150.138
SMILES:
Nc1nc2cc[nH]c2c(=O)[nH]1
: