Target
Sodium/glucose cotransporter 1
Ligand
BDBM50394534
Substrate
Meas. Tech.
ChEMBL_856136 (CHEMBL2162524)
IC50
67±n/a nM
Citation
 Fushimi, NFujikura, HShiohara, HTeranishi, HShimizu, KYonekubo, SOhno, KMiyagi, TItoh, FShibazaki, TTomae, MIshikawa-Takemura, YNakabayashi, TKamada, NOzawa, TKobayashi, SIsaji, M Structure-activity relationship studies of 4-benzyl-1H-pyrazol-3-ylß-d-glucopyranoside derivatives as potent and selective sodium glucose co-transporter 1 (SGLT1) inhibitors with therapeutic activity on postprandial hyperglycemia. Bioorg Med Chem 20:6598-612 (2012)  
Target
Name:
Sodium/glucose cotransporter 1
Synonyms:
SC5A1_RAT Slc5a1
Type:
PROTEIN
Mol. Mass.:
73065.64
Organism:
Rattus norvegicus
Description:
ChEMBL_938466
Residue:
665
  
Inhibitor
Name:
BDBM50394534
Synonyms:
CHEMBL2159102
Type:
Small organic molecule
Emp. Form.:
C21H30N2O6
Mol. Mass.:
406.4727
SMILES:
CC(C)c1n[nH]c(O[C@@H]2O[C@H](CO)[C@@H](O)[C@H](O)[C@H]2O)c1Cc1ccc(C)cc1C
: