Target
Fatty acid synthase
Ligand
BDBM50148911
Substrate
Meas. Tech.
ChEMBL_857805 (CHEMBL2169238)
IC50
59300±n/a nM
Citation
 Abramson, HN The lipogenesis pathway as a cancer target. J Med Chem 54:5615-38 (2011)  
Target
Name:
Fatty acid synthase
Synonyms:
FAS FAS_CHICK | Fatty acid synthase (FAS)
Type:
Enzyme
Mol. Mass.:
274770.36
Organism:
Gallus gallus (Chicken)
Description:
P12276
Residue:
2512
  
Inhibitor
Name:
BDBM50148911
Synonyms:
(3beta)-3-hydroxyurs-12-en-28-oic acid CHEMBL169 malol urson
Type:
Small organic molecule
Emp. Form.:
C30H48O3
Mol. Mass.:
456.7003
SMILES:
C[C@@H]1CC[C@@]2(CC[C@]3(C)C(=CC[C@@H]4[C@@]5(C)CC[C@H](O)C(C)(C)[C@@H]5CC[C@@]34C)[C@@H]2[C@H]1C)C(O)=O
: