Target
Fatty acid synthase
Ligand
BDBM50256128
Substrate
Meas. Tech.
ChEMBL_857799 (CHEMBL2169042)
IC50
32430±n/a nM
Citation
 Abramson, HN The lipogenesis pathway as a cancer target. J Med Chem 54:5615-38 (2011)  
Target
Name:
Fatty acid synthase
Synonyms:
FAS FAS_HUMAN HU FASN
Type:
Enzyme
Mol. Mass.:
273419.37
Organism:
Homo sapiens (Human)
Description:
P49327
Residue:
2511
  
Inhibitor
Name:
BDBM50256128
Synonyms:
(2R,3S)-4-methylene-2-octyl-5-oxotetrahydrofuran-3-carboxylic acid CHEMBL449993
Type:
Small organic molecule
Emp. Form.:
C14H22O4
Mol. Mass.:
254.3221
SMILES:
CCCCCCCC[C@H]1OC(=O)C(=C)[C@@H]1C(O)=O
: